{"text_format":"1","workbook":"xlsx","n_sheets":4,"sheets":["BD1","BD2","FORMATO 11","DATA"],"not_rendered":{"charts":0,"images":2,"macros":1,"external_links":1,"defined_names":132,"comments":0,"pivot_tables":0},"unopened":[],"bounds":{"document_bytes":16777216,"sheet_cells":100000,"rows_first":2000,"rows_last":500,"rows_between":2000,"halvings":0,"cell_chars":16384,"cell_head_chars":4096},"cells_cut":0,"cells_raw":0,"read":"whole","date_system":"1900"}

{"sheet":"BD1","index":0,"n_rows":10008,"n_cols":21,"rows_kept":10008,"cut":false,"hidden":false,"merged":[[2,14,4,16],[0,0,0,20],[6,0,6,2],[2,0,2,2],[4,0,4,2],[4,3,4,4],[2,4,2,6],[2,9,2,11],[6,17,6,19]]}
["REGISTRO DE POBLACION PENAL - OTT"]
[null,null,null,{"$f":"VLOOKUP(D3,DATA!C23:D30,2,0)","v":{"$error":"#N/A"}}]
["OFICINA REGIONAL:",null,null,null,{"$f":"IFERROR(VLOOKUP(D3,DATA!A23:B30,2,0),\"\")","v":""},null,null,"ESTABLECIMIENTO:",null,{"$f":"IFERROR(VLOOKUP(I3,DATA!A34:B104,2,0),\"\")","v":""},null,null,null,null,"Desarrollado por la Unidad de Estadística de la Sede Central - Consultas y Observaciones al RPM #220991"]
[]
["MES A REPORTAR:",null,null,null,null,null,null,"AÑO A REPORTAR:",null,null,"v. 14.9"]
[]
["automático",null,null,null,null,null,"automático",null,null,null,null,null,null,null,null,null,null,"EVALUACION SEMESTRAL"]
["N°","O.R.","E.P.","D.N.I.","Apellidos y Nombres","Fecha Nacimiento","Edad","Situación Jurídica","Genero","Delito Genérico","Delito Específico","Fecha Ing. Penal","N° Ingresos","Fecha de Clasificación","Pabellon","Régimen","Etapa","Fecha Evaluación","Resultado de la Evaluación","Calificación","Observaciones"]
[{"$f":"IF(E9>0,ROW()-8,\"\")","v":""},{"$f":"IF(E9>0,$D$3,\"\")","v":""},{"$f":"IF(E9>0,$I$3,\"\")","v":""},null,null,null,{"$f":"DATEDIF(F9,NOW(),\"y\")","v":122}]
[{"$f":"IF(E10>0,ROW()-8,\"\")","v":""},{"$f":"IF(E10>0,$D$3,\"\")","v":""},{"$f":"IF(E10>0,$I$3,\"\")","v":""},null,null,null,{"$f":"DATEDIF(F10,NOW(),\"y\")","v":122}]
["","","",null,null,null,122]
["","","",null,null,null,122]
["","","",null,null,null,122]
["","","",null,null,null,122]
["","","",null,null,null,122]
["","","",null,null,null,122]
["","","",null,null,null,122]
["","","",null,null,null,122]
["","","",null,null,null,122]
["","","",null,null,null,122]
{"$rows_left_out":9989}
{"sheet":"BD2","index":1,"n_rows":100,"n_cols":15,"rows_kept":100,"cut":false,"hidden":true,"merged":[[1,0,1,14],[3,0,3,3],[3,7,3,9],[3,10,3,13]]}
[]
["RELACIÓN DE DOCUMENTOS RECIBIDOS Y REMITIDOS "]
[]
["Datos Automático",null,null,null,null,null,null,"DOCUMENTO RECIBIDO",null,null,"DOCUMENTO REMITIDO"]
["N°","O.R.","E.P.","Mes","Tipo Inst. Educativa","Apellidos y Nombres","Género","Fecha","Dependencia Inicio","Descripción Documento","Tipo de Documento","Fecha de Expedición","N° Recibo TUPA","Motivo de Expedición","Observaciones"]
[{"$f":"IF(F6>0,ROW()-5,\"\")","v":""},{"$f":"IF(F6>0,'BD1'!$D$3,\"\")","v":""},{"$f":"IF(F6>0,'BD1'!$I$3,\"\")","v":""},{"$f":"IF(F6>0,'BD1'!$D$5,\"\")","v":""}]
[{"$f":"IF(F7>0,ROW()-5,\"\")","v":""},{"$f":"IF(F7>0,'BD1'!$D$3,\"\")","v":""},{"$f":"IF(F7>0,'BD1'!$I$3,\"\")","v":""},{"$f":"IF(F7>0,'BD1'!$D$5,\"\")","v":""}]
["",{"$f":"IF(F8>0,'BD1'!$D$3,\"\")","v":""},{"$f":"IF(F8>0,'BD1'!$I$3,\"\")","v":""},{"$f":"IF(F8>0,'BD1'!$D$5,\"\")","v":""}]
["",{"$f":"IF(F9>0,'BD1'!$D$3,\"\")","v":""},{"$f":"IF(F9>0,'BD1'!$I$3,\"\")","v":""},{"$f":"IF(F9>0,'BD1'!$D$5,\"\")","v":""}]
["",{"$f":"IF(F10>0,'BD1'!$D$3,\"\")","v":""},{"$f":"IF(F10>0,'BD1'!$I$3,\"\")","v":""},{"$f":"IF(F10>0,'BD1'!$D$5,\"\")","v":""}]
["",{"$f":"IF(F11>0,'BD1'!$D$3,\"\")","v":""},{"$f":"IF(F11>0,'BD1'!$I$3,\"\")","v":""},{"$f":"IF(F11>0,'BD1'!$D$5,\"\")","v":""}]
["",{"$f":"IF(F12>0,'BD1'!$D$3,\"\")","v":""},{"$f":"IF(F12>0,'BD1'!$I$3,\"\")","v":""},{"$f":"IF(F12>0,'BD1'!$D$5,\"\")","v":""}]
["",{"$f":"IF(F13>0,'BD1'!$D$3,\"\")","v":""},{"$f":"IF(F13>0,'BD1'!$I$3,\"\")","v":""},{"$f":"IF(F13>0,'BD1'!$D$5,\"\")","v":""}]
["",{"$f":"IF(F14>0,'BD1'!$D$3,\"\")","v":""},{"$f":"IF(F14>0,'BD1'!$I$3,\"\")","v":""},{"$f":"IF(F14>0,'BD1'!$D$5,\"\")","v":""}]
["",{"$f":"IF(F15>0,'BD1'!$D$3,\"\")","v":""},{"$f":"IF(F15>0,'BD1'!$I$3,\"\")","v":""},{"$f":"IF(F15>0,'BD1'!$D$5,\"\")","v":""}]
["",{"$f":"IF(F16>0,'BD1'!$D$3,\"\")","v":""},{"$f":"IF(F16>0,'BD1'!$I$3,\"\")","v":""},{"$f":"IF(F16>0,'BD1'!$D$5,\"\")","v":""}]
["",{"$f":"IF(F17>0,'BD1'!$D$3,\"\")","v":""},{"$f":"IF(F17>0,'BD1'!$I$3,\"\")","v":""},{"$f":"IF(F17>0,'BD1'!$D$5,\"\")","v":""}]
["",{"$f":"IF(F18>0,'BD1'!$D$3,\"\")","v":""},{"$f":"IF(F18>0,'BD1'!$I$3,\"\")","v":""},{"$f":"IF(F18>0,'BD1'!$D$5,\"\")","v":""}]
["",{"$f":"IF(F19>0,'BD1'!$D$3,\"\")","v":""},{"$f":"IF(F19>0,'BD1'!$I$3,\"\")","v":""},{"$f":"IF(F19>0,'BD1'!$D$5,\"\")","v":""}]
["",{"$f":"IF(F20>0,'BD1'!$D$3,\"\")","v":""},{"$f":"IF(F20>0,'BD1'!$I$3,\"\")","v":""},{"$f":"IF(F20>0,'BD1'!$D$5,\"\")","v":""}]
{"$rows_left_out":81}
{"sheet":"FORMATO 11","index":2,"n_rows":79,"n_cols":23,"rows_kept":79,"cut":false,"hidden":false,"merged":[[1,1,1,22],[4,1,5,22],[10,1,10,3],[10,4,10,6],[10,7,10,11],[10,12,10,13],[10,14,10,21],[28,8,28,9],[12,1,12,3],[12,6,12,8],[12,10,12,12],[18,1,18,22],[20,10,21,10],[20,11,20,13],[20,14,20,16],[20,6,22,7],[20,8,22,9],[24,8,24,9],[25,8,25,9],[26,8,26,9],[27,8,27,9],[23,6,23,7],[23,8,23,9],[42,2,42,3],[42,12,42,13],[35,2,36,10],[35,12,36,20],[38,2,39,3],[38,4,39,4],[38,5,38,7],[38,8,38,10],[38,12,39,13],[38,14,39,14],[38,15,38,17],[38,18,38,20],[74,4,74,8],[74,15,74,19],[50,2,51,2],[50,3,50,5],[50,6,50,8],[50,9,51,9],[29,8,29,9],[32,1,32,22],[61,1,61,2],[62,1,67,22],[73,4,73,8],[73,15,73,19],[50,1,52,1],[43,2,43,3],[44,2,44,10],[49,2,49,8],[49,9,49,15],[45,15,45,17],[40,2,40,3],[40,12,40,13],[41,2,41,3],[41,12,41,13],[30,6,30,7],[30,8,30,9],[76,16,77,21],[78,16,78,21],[24,6,24,7],[25,6,25,7],[26,6,26,7],[27,6,27,7],[28,6,28,7],[29,6,29,7],[50,20,50,22],[49,16,49,22],[50,10,50,12],[50,13,50,15],[50,16,51,16],[50,17,50,19]]}
[]
[null,"FORMATO 11"]
[]
[]
[null,"ESTADÍSTICA DE LAS ACTIVIDADES DEL ÓRGANO TECNICO DE TRATAMIENTO"]
[]
[]
[]
[]
[null,null,null,null,null,{"$error":"#N/A"}]
[null,"OFICINA REGIONAL:",null,null,{"$f":"REPT('BD1'!D3,1)","v":""},null,null,"ESTABLECIMIENTO PENAL:",null,null,null,null,{"$f":"REPT('BD1'!I3,1)","v":""},null,{"$f":"REPT('BD1'!J3,1)","v":""}]
[]
[null,"PERIODO A INFORMAR:",null,null,null,"MES:",{"$f":"REPT('BD1'!D5,1)","v":""},null,null,"AÑO:",{"$f":"REPT('BD1'!I5,1)","v":""}]
[]
[]
[]
[]
[]
[null,"1. POBLACIÓN PENAL DISTRIBUIDOS POR RÉGIMEN SEGÚN SITUACIÓN JURÍDICA Y GÉNERO"]
[]
{"$rows_left_out":60}
{"sheet":"DATA","index":3,"n_rows":398,"n_cols":68,"rows_kept":398,"cut":false,"hidden":true,"merged":[]}
["TIPOEDUCATIVA",null,100,200,300,400,500,600,700,800,null,"C.V.C.S","CONTRA_EL_HONOR","C.FAMILIA","C.LIBERTAD","C.ORDEN_ECONOMICO","C.PATRIMONIO","C.CONFIANZA_Y_BUENA_FE_EN_LOS_NEGOC.","C.DERECHOS_INTELECTUALES","C.PATRIMONIO_CULTURAL","C.ORDEN_FINANCIERO_Y_MONETARIO","C.SEGURIDAD_PUBLICA","DELITOS_AMBIENTALES","C.TRANQUILIDAD_PUBLICA","C.ESTADO_Y_DEFENSA_NACIONAL","C.PODERES_DEL_ESTADO_Y_ORDEN_CONSTITUCIONAL","C.FE_PUBLICA","C.LA_HUMANIDAD","C.VOLUNTAD_POPULAR","C.ADMINISTRACION_PUBLICA","DELITO_TRIBUTARIO_D.L._813","DELITOS_ADUANEROS_LEY_28008","LAVADO_DE_ACTIVOS_LEY_27765","OTROS",null,null,"CICLO_INICIAL","CICLO_INTERMEDIO","CICLO_AVANZADO","ADMINISTRACIÓN_Y_COMERCIO_I","ADMINISTRACIÓN_Y_COMERCIO_II","ACTIVIDADES_AGRARIAS_I","ACTIVIDADES_AGRARIAS_II","ARTES_GRÁFICAS_I","ARTES_GRÁFICAS_II","ARTESANÍA_Y_MANUALIDADES_I","ARTESANIA_Y_MANUALIDADES_II","COMPUTACIÓN_E_INFORMÁTICA_I","COMPUTACIÓN_E_INFORMÁTICA_II","CONSTRUCCIONES_I","CONSTRUCCIONES_II","CUERO_Y_CALZADO_I","CUERO_CALZADO_II","ELECTRICIDAD_Y_ELECTRÓNICA_I","ELECTRICIDAD_Y_ELECTRÓNICA_II","ESTÉTICA_PERSONAL_I","ESTÉTICA_PERSONAL_II","HOSTELERÍA_Y_TURISMO_I","HOSTELERÍA_Y_TURISMO_II","INDUSTRIAS_ALIMENTARIAS_I","INDUSTRIAS_ALIMENTARIAS_II","MECÁNICA_Y_METALES_I","MECÁNICA_Y_METALES_II","MECÁNICA_Y_MOTORES_I","MECÁNICA_Y_MOTORES_II","TEXTIL_Y_CONFECCIÓN_I","TEXTIL_Y_CONFECCIÓN_II","IDIOMA_EXTRANJERO"]
["CETPRO",null,102,201,301,411,501,601,701,803,null,"HOMICIDIO","UNICO INJURIA, CALUMNIA Y DIFAMACION","MATRIMONIOS ILEGALES","VIOLACION DE LA LIBERTAD PERSONAL","ABUSO DEL PODER ECONOMICO","HURTO","ATENTADOS CONTRA EL SISTEMA CREDITICIO","DELITOS CONTRA LOS DERECHOS DE AUTOR Y CONEXOS","UNICO DELITOS CONTRA LOS BIENES CULTURALES","DELITOS FINANCIEROS","DELITOS DE PELIGRO COMUN","DELITOS DE CONTAMINACION","DELITOS CONTRA LA PAZ PUBLICA","ATENTADOS CONTRA LA SEGURIDAD NACIONAL Y TRAICION A LA PATRIA","REBELION, SEDICION Y MOTIN","FALSIFICACION DE DOCUMENTOS EN GENERAL","GENOCIDIO","DELITOS CONTRA EL DERECHO DE SUFRAGIO","USURPACION DE AUTORIDAD, TITULOS Y HONORES","DEFRAUDACION TRIBUTARIA","CONTRABANDO","Actos de Conversión y Transferencia","INIMPUTABLE",null,null,"INICIAL 1","INTER 1","AVAN 1","VENTAS  AL DETALLE EN TIENDA","LOGÌSTICA Y ALMACENES","JARDINERÍA","PRODUCCIÓN AGROPECUARIA","ENCUADERNACIÓN","CONTEXTUALIZACIÓN DEL CATÁLOGO1","ARTESANIA EN  METALES Y  PIEDRA","JOYERÍA","PROPUESTA DE EXPERIMENTACIÓN  ","OPERACIÓN DE COMPUTADORAS","VIDRIERÍA","ALBAÑILERIA","CUERO Y CALZADO","CONFECCIÓN DE CALZADOS","CONTEXTUALIZACION DE CATALOGO5","ELECTROMECÁNICA","PELUQUERÍA","COSMETOLOGÍA","ASISTENCIA  EN COCINA","COCINA","MATARIFE Y PREPARACIONES  CÁRNICAS BÁSICAS","CONSERVACIÓN DE CARNES, PRODUCTOS HIDROBIOLÓGICOS Y VEGETALES "," CONTEXTUALIZADO DEL CATÁLOGO 9","CONSTRUCCIONES METÁLICAS","PLANCHADO Y PINTURA","MECÁNICA AUTOMOTRIZ","HILANDERÍA INDUSTRIAL","TINTORERIA Y ACABADOS TEXTILES","INGLES"]
["CEBA",null,111,212,303,412,511,610,704,808,null,"106 HOMICIDIO SIMPLE ","130 INJURIA ","139 BIGAMIA ","151 COACCION ","232 ABUSO DEL PODER ECONOMICO ","185 HURTO SIMPLE ","209 INSOLVENCIA FRAUDULENTA ","216 VIOLACION DE LOS DERECHOS DE AUTOR ","226 ATENTADOS CONTRA MONUMENTOS ARQUEOLOGICOS ","244 CONCENTRACION CREDITICIA ","273 PRODUCCION DE PELIGRO COMUN CON MEDIOS CATASTROFICOS ","304 CONTAMINACION DEL AMBIENTE ","315 DISTURBIOS ","325 ATENTADO CONTRA LA SOBERANIA NACIONAL ","346 REBELION ","427 FALSIFICACION DE DOCUMENTO ","319 GENOCIDIO ","354 PERTURBACION VIOLENTA DEL PROCESO ELECTORAL ","362 OSTENTACION DE TITULO U HONORES QUE NO EJERCE ",null,"DEFRAUDACIÓN DE RENTAS DE ADUANA","Actos de Ocultamiento y Tenencia",null,null,null,"INICIAL 2","INTER 2","AVAN 2",null,null,"EXTRACCCIÓN Y TRASNFORMACIÓN PRIMARIA DE RECURSOS MADERABLES EN SELVA","JARDINERÍA Y  FLORICULTURA","CONTEXTUALIZACIÓN DEL CATÁLOGO",null,"PROPUESTA DE EXPERIMENTACIÓN  ","CONTEXTUALIZACIÓN DEL CATÁLOGO2",null,"CONTEXTUALIZACIÓN DEL CATÁLOGO 3","MANTENIMIENTO   BÁSICO  DE CASAS Y EDIFICIOS","CARPINTERIA",null,"CURTIEMBRE Y PELETERÍA","CONTEXTUALIZACION DE CATALOGO6","EQUIPOS ELECTRÓNICOS DE CONSUMO","CONTEXTUALIZACIÓN  DEL CATÁLOGO 7","CONTEXTUALIZACIÓN DEL CATÁLOGO 8","SERVICIO DE MESA","PASTELERÍA Y PANADERÍA","VITICULTURA  Y ELABORACIÓN DE VINOS , PISCOS  Y OTROS PRODUCTOS AFINES","INDUSTRIAS  LÁCTEAS"," CONTEXTUALIZADO DEL CATÁLOGO 10","MATRICERÍA",null,"MECÁNICA DE EQUIPOS PESADOS","TINTORERIA Y ESTAMPADO INDUSTRIAL","CONFECCIÓN INDUSTRIAL","FRANCES"]
["IEI",null,114,221,306,413,512,621,705,811,null,"107 PARRICIDIO ","131 CALUMNIA ","140 CONOCIMIENTO DE IMPEDIMENTO POR EL CONYUGUE LIBRE ","152 SECUESTRO - GRADO TENTATIVA ",null,"186 HURTO AGRAVADO - GRADO TENTATIVA ","210 QUIEBRA CULPOSA ","217 REPRODUCCION, DIFUSION, DISTRIBUCION Y CIRCULACION DE LA OBRA SIN LA AUTORIZACION DEL AUTOR ","227 INDUCCION A LA COMISION DE ATENTADOS CONTRA YACIMIENTOS ARQUEOLOGICOS ","245 OCULTAMIENTO, OMISION O NEGATIVA DE INFORMACION ","274 CONDUCCION EN ESTADO DE EBRIEDAD O DROGADICCION ","305 FORMAS AGRAVADAS ","316 APOLOGIA ","326 PARTICIPACION EN GRUPO ARMADO ","347 SEDICION ","427 FALSIFICACION DE SELLOS ","DESAPARICION FORZADA","355 IMPEDIMENTO DEL EJERCICIO DE DERECHO DE SUFRAGIO ","363 EJERCICIO ILEGAL DE PROFESION ",null,"RECEPTACIÓN ADUANERA","Formas Agravadas",null,null,null,null,"INTER 3","AVAN 3",null,null,"AGRICULTURA ORGÁNICA","CONSERVACIÓN Y APROVECHAMIENTO RACIONAL DE RECURSOS FORESTALES",null,null,null,null,null,"ADMINISTRACIÓN DE REDES",null,"GASFITERÍA",null,null,null,"REFRIGERACIÓN  Y AIRE ACONDICIONADO",null,null,"ASISTENCIA DE PANADERÍA Y PASTELERÍA","SERVICIO DE RESTAURANT Y BAR","GANADERÍA Y TRASFORMACIONES LÁCTEAS","EXTRACCIÓN DE ACEITE, GRASAS Y AZÚCAR",null,"MECÁNICA DE PLANTA",null,"TRANSPORTE  TERRESTRE  Y OPERACIÓN DE EQUIPOS PESADOS ","BORDADOS COMPUTARIZADOS Y MANUALES","CONTEXTUALIZACIÓN DEL CATÁLOGO12","ITALIANO"]
[null,null,117,231,321,414,543,622,706,821,null,"108 HOMICIDIO CALIFICADO - ASESINATO ","132 DIFAMACION ","141 AUTORIZACION ILEGAL DE MATRIMONIO POR FUNCIONARIO PUBLICO ","152 SECUESTRO ","ACAPARAMIENTO, ESPECULACION, ADULTERACION","186 HURTO AGRAVADO ","211 UTILIZACION DE INFORMACION FALSA ","218 DELITOS CONTRA LOS DERECHOS DE AUTOR Y CONEXOS - FORMAS AGRAVADAS ","228 EXTRACCION ILEGAL DE BIENES CULTURALES ","246 INSTITUCIONES FINANCIERAS ILEGALES ","274-A MANIPULACION EN ESTADO DE EBRIEDAD O DROGADICCION","306 INCUMPLIMIENTO DE LAS NORMAS RELATIVAS AL MANEJO DE RESIDUOS SOLIDOS ","317 ASOCIACION ILICITA PARA DELINQUIR ","327 DESTRUCCION O ALTERACION DE HITOS FRONTERIZOS ","348 MOTIN ","428 FALSEDAD IDEOLOGICA ","320 DESAPARICION FORZADA COMETIDA POR FUNCIONARIO PUBLICO ","356 INDUCCION A NO VOTAR O HACERLO EN SENTIDO DETERMINADO ","364 PARTICIPACION DE PROFESIONAL EN EL EJERCICIO ILEGAL DE UNA PROFESION ",null,"FINANCIAMIENTO",null,null,null,null,null,null,"AVAN 4",null,null,"CULTIVOS HIDROPÓNICOS","AVICULTURA Y CRIANZA DE ANIMALES MENORES",null,null,null,null,null,"ADMINISTRACIÓN DE BASE DE DATOS",null,"EBANISTERÍA",null,null,null,"INSTALACIONES ELECTROTÉCNICAS",null,null,"SERVICIOS BÁSICOS DE RECEPCIÓN HOSTELERA","AVIACIÓN COMERCIAL","CONSERVACIÓN Y SEMICONSERVACIÓN  DE PESCADOS Y MAR4ISCOS","PRODUCCIÓN INDUSTRIAL DE VINOS, PISCOS Y OTROS PRODUCTOS AFINES",null,null,null,null,"CONFECCIÓN TEXTIL","SASTRERÍA","CHINO MANDARIN"]
[null,null,125,232,331,416,null,627,721,null,null,"109 HOMICIDIO POR EMOCION VIOLENTA ","133 ATIPICIDAD ","142 INOBSERVANCIA DE LAS FORMALIDADES POR FUNCIONARIO PUBLICO ","153 TRATA DE PERSONAS ","233 ACAPARAMIENTO ","187 HURTO DE USO ","212 REDUCCION DE PENA POR INFORMACION EFICAZ ","219 PLAGIO ","229 INTERVENCION O FACILITACION DE FUNCIONARIO PUBLICO ","247 OBTENCION FRAUDULENTA DE CREDITO ","275 DELITOS DE PELIGRO CUMUN - CIRCUNSTANCIAS AGRAVANTES ","307 TRAFICO ILEGAL DE RESIDUOS PELIGROSOS ","317 ASOCIACION ILICITA ","328 CIRCUNSTANCIAS AGRAVANTES ","349 CONSPIRACION ","429 OMISION DE CONSIGNAR DECLARACIONES EN DOCUMENTOS ",null,"357 SUPLANTACION DE VOTANTE ",null,null,"TRÁFICO DE MERCANCÍAS PROHIBIDAS O RESTRINGIDAS",null,null,null,null,null,null,null,null,null,"MANEJO DE IMAQUINARÍA Y EQUIPOS AGRÍCOLAS",null,null,null,null,null,null,"MANTENIMIENTO DE EQUIPOS DE CÓMPUTO",null,"CONTEXTUALIZACION DE CATALOGO4",null,null,null,null,null,null,null,null,null,"MOLINERÍA Y PROCESAMIENTO DE GRANOS Y TUBÉRCULOS",null,null,null,null,"CONTEXTUALIZADO DEL CATÁLOGO11",null,"OTROS"]
["MES",null,131,233,332,417,null,631,722,null,null,"110 INFANTICIDIO ","134 LA \"EXCEPTIO VERITATIS\": PROCEDENCIA ",null,"153-A FORMAS AGRAVADAS DE LA TRATA DE PERSONAS ","234 ESPECULACION ","ROBO","213 EJERCICIO DE LA ACCION PENAL ","220 PLAGIO - FORMAS AGRAVADAS ","230 DESTRUCCION, ALTERACION O EXTRACCION DE BIENES CULTURALES ","248 CONDICIONAMIENTOS DE CREDITOS ","276 ESTRAGOS ESPECIALES ","307-A DELITO DE MINERIA ILEGAL","317-A MARCAJE O REGLAJE","329 INTELIGENCIA DESLEAL CON EL EXTRANJERO ","350 SEDUCCION, USURPACION Y RETENCION ILEGAL DE MANDO DE TROPAS ","430 SUPRESION, DESTRUCCION U OCULTAMIENTO DE DOCUMENTOS ","TORTURA","358 VOTO DECLARADO PUBLICAMENTE DURANTE EL ACTO ELECTORAL ","VIOLENCIA Y RESISTENCIA A LA AUTORIDAD",null,"TENTATIVA",null,null,null,null,null,null,null,null,null,"MANEJO DE INSTALACIONES HORTOFRUTÍCOLAS",null,null,null,null,null,null,null,null,null,null,null,null,null,null,null,null,null,null,"PANADERÍA Y PASTELERÍA INDUSTRIAL",null,null,null,null,"TAPICERÍA"]
["ENERO",null,132,234,null,421,null,641,724,null,null,"111 HOMICIDIO CULPOSO ","135 INADMISIBILIDAD DE LA EXCEPTIO VERITATIS ","DELITOS CONTRA EL ESTADO CIVIL","VIOLACION DE LA INTIMIDAD","235 ADULTERACION ","188 ROBO ","213-A ACTOS CONTRA LA FINALIDAD DEL PATRIMONIO DE PROPOSITO EXCLUSIVO ","220-A ELUSION DE MEDIDAS ELECTRONICAS ","231 DECOMISO ","249 PANICO FINANCIERO ","277 DAÑO DE OBRAS DESTINADAS A LA DEFENSA COMUN ","307-B FORMAS AGRAVADAS","318 OFENSAS A LA MEMORIA DE LOS MUERTOS ","330 REVELACION DE SECRETOS NACIONALES ",null,"431 EXPEDICION DE CERTIFICADO MEDICO FALSO ","321 TORTURA SIMPLE Y CUALIFICADA ","359 ATENTADOS CONTRA EL DERECHO DE SUGRAGIO: FRAUDE ELECTORAL ","366 VIOLENCIA CONTRA LA AUTORIDAD PARA IMPEDIR EL EJERCICIO DE SUS FUNCIONES ",null,"CIRCUNSTANCIAS AGRAVANTES",null,null,null,null,null,null,null,null,null,"MANEJO DE GANADO VACUNO",null,null,null,null,null,null,null,null,null,null,null,null,null,null,null,null,null,null,"CONFITERÍA INDUSTRIAL"]
["FEBRERO",null,136,235,null,431,null,null,733,null,null,"112 HOMICIDIO PIADOSO ","136 DIFAMACION O INJURIA ENCUBIERTA O EQUIVOCA ","143 SUPRESION O ALTERACION DEL ESTADO CIVIL ","154 VIOLACION DE LA INTIMIDAD ","236 AGRAVANTES ","189 ART 188 TIPO BASE CONCOR CON EL INC 2 DEL ART 189 ",null,"220-B PRODUCTOS DESTINADOS A LA ELUSION DE MEDIDAS TECNOLOGICAS ",null,"250 OMISION DE LAS PROVISIONES ESPECIFICAS ","278 DELITOS DE PELIGRO CUMUN - MODALIDADES CULPOSAS ","307-C DELITO DE FINANCIAMIENTO DE LA MINERIA ILEGAL","318-A DELITO DE INTERMEDIACION ONEROSA DE ORGANOS Y TEJIDOS ","331 ESPIONAJE ","DISPOSICIONES COMUNES","431-A SIMULACION DE ACCIDENTE DE TRANSITO ","322 TORTURA COMETIDA CON PARTICIPACION DE PROFESIONALES DE LA SALUD ","360 INHABILITACION ","367 FORMAS AGRAVADAS ",null,null,null,null,null,null,null,null,null,null,null,"AGRICULTURA DE COSTA"]
["MARZO",null,141,236,null,442,null,null,734,null,null,"113 INSTIGACION Y/O AYUDA AL SUICIDIO ","137 INJURIAS RECIPROCAS ","144 FINGIMIENTO DE ESTADO DE GRAVIDEZ O PARTO ","155 AGRAVANTE POR RAZON DE LA FUNCION ","VENTA ILICITA DE MERCADERIAS","189 ROBO AGRAVADO GRADO TENTATIVA ","USURA","220-C SERVICIOS DESTINADOS A LA ELUSION DE MEDIDAS TECNOLOGICAS ",null,"251 DESVIO FRAUDULENTO DE CREDITO PROMOCIONAL ","279 FABRICACION ILEGAL DE ARMAS Y MUNICIONES ","307-E ACTOS PREPARATORIOS DE MINERIA ILEGAL",null,"332 FAVORECIMIENTO BELICO A ESTADO EXTRANJERO ","351 EXENCION DE LA PENA POR DESESTIMIENTO VOLUNTARIO ","432 INHABILITACION ",null,null,"368 RESISTENCIA Y DESOBEDIENCIA A LA AUTORIDAD ",null,null,null,null,null,null,null,null,null,null,null,"AGRICULTURA DE SIERRA"]
["ABRIL",null,144,238,null,444,null,null,null,null,null,"107 FEMINICIDIO","138 ACCION PRIVADA - TITULARES DE LA ACCION PENAL ","145 ALTERACION O SUPRESION DE LA FILIACION DE MENOR ","156 REVELACION DE LA INTIMIDAD PERSONAL Y FAMILIAR ","237 BIENES PROVENIENTES DE DONACION ","189 ROBO AGRAVADO ","214 USURA ","220-D DELITOS CONTRA LA INFORMACION SOBRE GESTION DE DERECHOS ",null,"251-A ABUSO DE INFORMACION PRIVILIGEADA ","279 TENENCIA ILEGAL DE ARMAS ","307-F INHABILITACION","TERRORISMO - LEY 25475","333 PROVOCACION PUBLICA A LA DESOBEDIENCIA MILITAR ","352 OMISION DE RESISTENCIA ","433 EQUIPARACION A DOCUMENTO PUBLICO ","DISCRIMINACION",null,"368-A INGRESO INDEBIDO DE EQUIPOS O SISTEMAS DE COMUNICACIÓN, FOTOGRAFICA Y/O FILMACION EN CENTROS DE DETENCION O RECLUSION"]
["MAYO",null,148,239,null,null,null,null,null,null,null,"ABORTO",null,"146 MOVIL DE HONOR ","157 ORGANIZACION Y USO INDEBIDO DE ARCHIVOS COMPUTARIZADOS ",null,"ABIGEATO",null,"220-E ETIQUETAS, CARATULAS Y EMPAQUES ",null,null,"279 TENENCIA ILEGAL DE EXPLOSIVOS ",null,"1 TIPIFICACION DE TERRORISMO ","334 EXPATRIACION ","353 INHABILITACION ",null,"323 DISCRIMINACION ",null,"368-B INGRESO INDEBIDO DE MATERIALES O COMPONENTES CON FINES DE ELABORACION DE EQUIPOS DE COMUNICACIÓN EN CENTROS DE DETENCION O RECLUSION"]
["JUNIO",null,149,244,null,null,null,null,null,null,null,"114 AUTO-ABORTO ",null,null,"158 ACCION PRIVADA ","DE OTROS DELITOS ECONOMICOS","189-A HURTO DE GANADO ","LIBRAMIENTO Y COBRO INDEBIDO","220-F MANUALES Y LICENCIAS PARA PROGRAMAS DE ORDENADOR ",null,"DELITOS MONETARIOS","279 FABRICACION Y TENENCIA ILEGAL DE ARMAS, MUNICIONES Y EXPLOSIVOS ","DELITOS CONTRA LOS RECURSOS NATURALES","2 DELITO DE TERRORISMO ","DELITOS QUE COMPROMETEN LAS RELACIONES EXTERIORES DEL ESTADO",null,"FALSIFICACION DE SELLOS, TIMBRES Y MARCAS OFICIALES",null,null,"368-C SABOTAJE DE LOS EQUIPOS DE SEGURIDAD Y DE COMUNICACIÓN EN ESTABLECIMIENTOS PENITENCIARIOS"]
["JULIO",null,null,246,null,null,null,null,null,null,null,"115 ABORTO CONSENTIDO ",null,"ATENTADOS CONTRA LA PATRIA POTESTAD","VIOLACION DE DOMICILIO","238 PUBLICIDAD ENGAÑOSA SOBRE CALIDAD DE BIENES Y SERVICIOS ","189-B HURTO DE USO DE GANADO ","215 SUPUESTOS DE LIBRAMIENTOS INDEBIDOS ","221 INCAUTACION PREVENTIVA Y COMISO DEFINITIVO ",null,"252 FALSIFICACION DE BILLETES O MONEDAS ","279-A PRODUCCION, TRAFICO ILEGAL DE ARMAS, MUNICIONES Y EXPLOSIVOS ","308 TRAFICO ILEGAL DE ESPECIES DE FLORA Y FAUNA SILVESTRE PROTEGIDA ","4 COLABORACION CON EL TERRORISMO ","335 VIOLACION DE INMUNIDADES Y ULTRAJE A ESTADO EXTRANJERO ",null,"434 FABRICACION O FALSIFICACION DE SELLOS O TIMBRES OFICIALES ","MANIPULACION GENETICA",null,"368-D POSESION INDEBIDA DE TELEFONOS CELULARES O, ARMAS, MUNICIONES O MATERIALES EXPLOSIVOS, INFLAMABLES, ASFIXIANTES O TOXICOS EN ESTABLECIMIETNOPS PENITENCIARIOS"]
["AGOSTO",null,null,254,null,null,null,null,null,null,null,"116 ABORTO NO CONSENTIDO ",null,"147 SUSTRACCION DE MENOR ","159 VIOLACION DE DOMICILIO ","239 FRAUDE EN LA VENTA DE BIENES O EN LA PRESTACION DE SERVICIOS PUBLICITADOS ","189-C ROBO DE GANADO ",null,null,null,"253 ALTERACION DEL VALOR DEL BILLETES O MONEDAS ","279-B ARREBATO DE ARMAMENTO O MUNICIONES DE USO OFICIAL ","308-A TRAFICO ILEGAL DE ESPECIES ACUATICASDE LA FLORA Y FAUNA SILVESTRE PROTEGIDA ","5 AFILIACION A ORGANIZACIONES TERRORISTAS ","336 ATENTADO CONTRA EXTRANJERO CON PROTECCION INTERNACIONAL ",null,"435 FABRICACION O FALSIFICACION DE MARCAS O CONTRASEÑAS OFICIALES ","324 MANIPULACION GENETICA ",null,"368-E INGRESO INDEBIDO DE ARMAS, MUNICIONES O MATERIALES EXPLOSIVOS, INFLAMABLES, ASFIXIANTES O TOXICOS EN ESTABLECIMIETNOPS PENITENCIARIOS"]
["SETIEMBRE",null,null,256,null,null,null,null,null,null,null,"117 ABORTO AGRAVADO POR LA CUALIFICACION DEL SUJETO ACTIVO ",null,"148 INDUCCION A LA FUGA DE MENOR ","160 ALLANAMIENTO ILEGAL DE DOMICILIO ","240 COMPETENCIA DESLEAL ","APROPIACION ILICITA",null,"DELITOS CONTRA LA PROPIEDAD INDUSTRIAL",null,"254 TRAFICO DE MONEDAS Y BILLETES FALSOS ","279-C COMERCIALIZACION Y USO ILEGAL DE PRODUCTOS PIROTECNICOS ","308-B EXTRACCION ILEGAL DE ESPECIES ACUATICAS ","6 INSTIGACION (AL TERRORISMO) ","337 VIOLACION DE LA SOBERANIA EXTRANJERA ",null,"436 INHABILITACION ",null,null,"369 VIOLACION AL EJERCICIO PARLAMENTARIO, REGIONAL O MUNICIPAL "]
["OCTUBRE",null,null,257,null,null,null,null,null,null,null,"118 ABORTO PRETERINTENCIONAL ",null,"148-A INSTIGACION O PARTICIPACION EN PANDILLAJE PERNICIOSO ","VIOLACION DEL SECRETO DE LAS COMUNICACIONES","241 FRAUDE EN REMATES, LICITACIONES Y CONCURSOS PUBLICOS ","190 APROPIACION ILICITA COMUN ",null,"222 USO NO AUTORIZADO DE PRODUCTO ",null,"255 FABRICACION O IMPORTACION DE INSTRUMENTOS O INSUMOS CON FINES DE FALSIFICACION ","279-D EMPLEO, PRODUCCION Y TRANSFERENCIA DE MINAS ANTIPERSONALES ","308-C DEPREDACION DE FLORA Y FAUNA SILVESTRE PROTEGIDA ","6-A RECLUTAMIENTO DE PERSONAS (TERRORISMO) ","338 ACTOS DE ALTERACION DE ORGANIZACION POLITICA CONTRA UN ESTADO EXTRANJERO ",null,"437 SELLOS, TIMBRES Y MARCAS OFICIALES EQUIVALADOS A LOS NACIONALES ",null,null,"370 DESTRUCCION DE ENVOLTURAS, SELLOS O MARCAS PUESTAS POR LA AUTORIDAD "]
["NOVIEMBRE",null,null,259,null,null,null,null,null,null,null,"119 ABORTO TERAPEUTICO IMPUNE ",null,null,"161 VIOLACION DE CORRESPONDENCIA ","242 REHUSAMIENTO A PRESTAR INFORMACION A LA AUTORIDAD ","191 SUSTRACCION DE BIEN PROPIO ",null,"222-A PENALIZACION DE LA CLONACION O ADULTERACION DE TERMINALES DE TELEFONIA CELULAR ",null,"256 ALTERACION DE BILLETES O MONEDAS ","279-E ENSAMBLE,COMERCIALIZA,UTILIZACION EN EL SERV PUBLICO DE TRANSP DE OMNIBUS SOBRE CHASIS DE CAMION ","308-D TRAFICO ILEGAL DE RECURSOS GENETICOS ","7 APOLOGIA (AL TERRORISMO) ","339 ACTOS HOSTILES CONTRA ESTADO EXTRANJERO ",null,"437 MARCAS Y SELLOS EXTRANJEROS EQUIPARADOS A LOS NACIONALES ",null,null,"371 NEGATIVA A COLABORAR CON LA ADMINISTRACION DE JUSTICIA "]
["DICIEMBRE",null,null,261,null,null,null,null,null,null,null,"120 ABORTO SENTIMENTAL Y EUGENESICO ",null,"OMISION DE ASISTENCIA FAMILIAR","162 INTERFERENCIA TELEFONICA ","243 USO FRAUDULENTO DE MONEDA EXTRANJERA DE CAMBIO PREFERENCIAL ","192 MODALIDAD DE APROPIACION IRREGULAR ",null,"223 USO O VENTA NO AUTORIZADA DE DISEÑO O MODELO INDUSTRIAL ",null,"257 APLICACION EXTENSIVA DEL OBJETO MATERIAL DEL DELITO ","279-F USO DE ARMAS EN ESTADO DE EBRIEDAD O DROGADICCION","309 FORMAS AGRAVADAS ","8 OBSTACULIZACION DE ACCION DE LA JUSTICIA ","340 VIOLACION DE TRATADOS O CONVENCIONES INTERNACIONALES DE PAZ ",null,"DISPOSICIONES COMUNES",null,null,"372 ATENTADO CONTRA DOCUMENTOS QUE SIRVEN DE PRUEBA EN EL PROCESO "]
[null,null,null,262,null,null,null,null,null,null,null,null,null,"149 INCUMPLIMIENTO DE LA OBLIGACION ALIMENTARIA ","163 FRUSTRACION DE CORRESPONDENCIA EPISTOLAR O TELEGRAFICA ","243-A CASINOS DE JUEGO NO AUTORIZADOS ","193 APROPIACION DE PRENDA ",null,"224 INCAUTACION PREVENTIVA Y COMISO DEFINITIVO ",null,"257-A AGRAVANTES CUALIFICANTES EN LOS ART 252, 253, 254, 255 Y 257 ",null,"311 UTILIZACION INDEBIDA DE TIERRAS AGRICOLAS ",null,"341 ESPIONAJE MILITAR EN PERJUICIO DE ESTADO EXTRANJERO ",null,"438 FALSEDAD GENERICA ",null,null,"373 SUSTRACCION DE OBJETOS REQUISADOS "]
{"$rows_left_out":378}